Install error on bench

Hi,
I am trying to install frappe-bench for the current user using manual installation but getting an error.
I ll paste the traceback for the same…

Traceback (most recent call last):
File “install.py”, line 351, in
install_bench(args)
File “install.py”, line 108, in install_bench
run_playbook(‘develop/install.yml’, sudo=True, extra_vars=extra_vars)
File “install.py”, line 301, in run_playbook
success = subprocess.check_call(args, cwd=os.path.join(cwd, ‘playbooks’))
File “/usr/lib/python2.7/subprocess.py”, line 540, in check_call
raise CalledProcessError(retcode, cmd)
subprocess.CalledProcessError: Command ‘[‘ansible-playbook’, ‘-c’, ‘local’, ‘develop/install.yml’, ‘-e’, ‘@/tmp/extra_vars.json’, ‘–become’, ‘–become-user=user’]’ returned non-zero exit status 2

Use Easy Install method or search forum for solution as it already exists.

Hi there,
I tried the easy install as well and getting an error on that as well i ll paste the error log for the same…

TASK [init bench] **************************************************************
fatal: [localhost]: FAILED! => {“changed”: true, “cmd”: [“bench”, “init”, “/home/user/frappe-bench”, “–frappe-branch”, “develop”], “delta”: “0:10:37.353472”, “end”: “2016-11-19 16:51:12.241757”, “failed”: true, “rc”: 1, “start”: “2016-11-19 16:40:34.888285”, “stderr”: “INFO:bench.app:getting app frappe\nCloning into ‘frappe’…\nerror: RPC failed; result=56, HTTP code = 200\nfatal: The remote end hung up unexpectedly\nfatal: early EOF\nfatal: index-pack failed\nTraceback (most recent call last):\n File “/usr/local/bin/bench”, line 11, in \n load_entry_point(‘bench’, ‘console_scripts’, ‘bench’)()\n File “/home/user/.bench/bench/cli.py”, line 40, in cli\n bench_command()\n File “/usr/local/lib/python2.7/dist-packages/click/core.py”, line 716, in call\n return self.main(*args, **kwargs)\n File “/usr/local/lib/python2.7/dist-packages/click/core.py”, line 696, in main\n rv = self.invoke(ctx)\n File “/usr/local/lib/python2.7/dist-packages/click/core.py”, line 1060, in invoke\n return _process_result(sub_ctx.command.invoke(sub_ctx))\n File “/usr/local/lib/python2.7/dist-packages/click/core.py”, line 889, in invoke\n return ctx.invoke(self.callback, **ctx.params)\n File “/usr/local/lib/python2.7/dist-packages/click/core.py”, line 534, in invoke\n return callback(*args, **kwargs)\n File “/home/user/.bench/bench/commands/make.py”, line 19, in init\n verbose=verbose, clone_from=clone_from)\n File “/home/user/.bench/bench/utils.py”, line 56, in init\n get_app(frappe_path, branch=frappe_branch, bench_path=path, build_asset_files=False, verbose=verbose)\n File “/home/user/.bench/bench/app.py”, line 62, in get_app\n cwd=os.path.join(bench_path, ‘apps’))\n File “/home/user/.bench/bench/utils.py”, line 127, in exec_cmd\n raise CommandFailedError(cmd)\nbench.utils.CommandFailedError: git clone https://github.com/frappe/frappe.git --branch develop --origin upstream”, “stdout”: “Already using interpreter /usr/bin/python”, “stdout_lines”: [“Already using interpreter /usr/bin/python”], “warnings”: []}
to retry, use: --limit @develop/install.retry

PLAY RECAP *********************************************************************
localhost : ok=31 changed=12 unreachable=0 failed=1

Traceback (most recent call last):
File “install.py”, line 351, in
install_bench(args)
File “install.py”, line 108, in install_bench
run_playbook(‘develop/install.yml’, sudo=True, extra_vars=extra_vars)
File “install.py”, line 301, in run_playbook
success = subprocess.check_call(args, cwd=os.path.join(cwd, ‘playbooks’))
File “/usr/lib/python2.7/subprocess.py”, line 540, in check_call
raise CalledProcessError(retcode, cmd)
subprocess.CalledProcessError: Command ‘[‘ansible-playbook’, ‘-c’, ‘local’, ‘develop/install.yml’, ‘-e’, ‘@/tmp/extra_vars.json’, ‘–become’, ‘–become-user=user’]’ returned non-zero exit status 2

Dear Sir,

Even i try with the easy installation still i am facing the same error.

Looks like there’s a problem with git / the system

Have a look at this :