Local host error during installation

Screenshot here: https://ibb.co/fSrnwH

Here it is written out just in case the screenshot won’t load:

TASK [install erpnext to default site] *********************************************************************************************************************************************************************
fatal: [localhost]: FAILED! => {“changed”: true, “cmd”: [“bench”, “–site”, “site1.local”, “install-app”, “erpnext”], “delta”: “0:00:03.461665”, “end”: “2018-02-05 16:56:26.512059”, “failed”: true, “rc”: 1, “start”: “2018-02-05 16:56:23.050394”, “stderr”: “Traceback (most recent call last):\n File “/usr/lib/python2.7/runpy.py”, line 174, in _run_module_as_main\n “main”, fname, loader, pkg_name)\n File “/usr/lib/python2.7/runpy.py”, line 72, in _run_code\n exec code in run_globals\n File “/home/testbox/frappe-bench/apps/frappe/frappe/utils/bench_helper.py”, line 94, in \n main()\n File “/home/testbox/frappe-bench/apps/frappe/frappe/utils/bench_helper.py”, line 18, in main\n click.Group(commands=commands)(prog_name=‘bench’)\n File “/home/testbox/frappe-bench/env/local/lib/python2.7/site-packages/click/core.py”, line 722, in call\n return self.main(*args, **kwargs)\n File “/home/testbox/frappe-bench/env/local/lib/python2.7/site-packages/click/core.py”, line 697, in main\n rv = self.invoke(ctx)\n File “/home/testbox/frappe-bench/env/local/lib/python2.7/site-packages/click/core.py”, line 1066, in invoke\n return _process_result(sub_ctx.command.invoke(sub_ctx))\n File “/home/testbox/frappe-bench/env/local/lib/python2.7/site-packages/click/core.py”, line 1066, in invoke\n return _process_result(sub_ctx.command.invoke(sub_ctx))\n File “/home/testbox/frappe-bench/env/local/lib/python2.7/site-packages/click/core.py”, line 895, in invoke\n return ctx.invoke(self.callback, **ctx.params)\n File “/home/testbox/frappe-bench/env/local/lib/python2.7/site-packages/click/core.py”, line 535, in invoke\n return callback(*args, **kwargs)\n File “/home/testbox/frappe-bench/env/local/lib/python2.7/site-packages/click/decorators.py”, line 17, in new_func\n return f(get_current_context(), *args, **kwargs)\n File “/home/testbox/frappe-bench/apps/frappe/frappe/commands/init.py”, line 24, in _func\n ret = f(frappe._dict(ctx.obj), *args, **kwargs)\n File “/home/testbox/frappe-bench/apps/frappe/frappe/commands/site.py”, line 165, in install_app\n _install_app(app, verbose=context.verbose)\n File “/home/testbox/frappe-bench/apps/frappe/frappe/installer.py”, line 109, in install_app\n frappe.clear_cache()\n File “/home/testbox/frappe-bench/apps/frappe/frappe/init.py”, line 516, in clear_cache\n for fn in get_hooks(“clear_cache”):\n File “/home/testbox/frappe-bench/apps/frappe/frappe/init.py”, line 832, in get_hooks\n hooks = _dict(cache().get_value(“app_hooks”, load_app_hooks))\n File “/home/testbox/frappe-bench/apps/frappe/frappe/utils/redis_wrapper.py”, line 73, in get_value\n val = generator()\n File “/home/testbox/frappe-bench/apps/frappe/frappe/init.py”, line 810, in load_app_hooks\n for app in [app_name] if app_name else get_installed_apps(sort=True):\n File “/home/testbox/frappe-bench/apps/frappe/frappe/init.py”, line 774, in get_installed_apps\n installed = json.loads(db.get_global(“installed_apps”) or “[]”)\n File “/home/testbox/frappe-bench/apps/frappe/frappe/database.py”, line 726, in get_global\n return self.get_default(key, user)\n File “/home/testbox/frappe-bench/apps/frappe/frappe/database.py”, line 738, in get_default\n d = self.get_defaults(key, parent)\n File “/home/testbox/frappe-bench/apps/frappe/frappe/database.py”, line 744, in get_defaults\n defaults = frappe.defaults.get_defaults(parent)\n File “/home/testbox/frappe-bench/apps/frappe/frappe/defaults.py”, line 57, in get_defaults\n globald = get_defaults_for()\n File “/home/testbox/frappe-bench/apps/frappe/frappe/defaults.py”, line 177, in get_defaults_for\n where parent = %s order by creation”"", (parent,), as_dict=1)\n File “/home/testbox/frappe-bench/apps/frappe/frappe/database.py”, line 143, in sql\n self.connect()\n File “/home/testbox/frappe-bench/apps/frappe/frappe/database.py”, line 93, in connect\n charset=‘utf8mb4’, use_unicode = True, conv = conversions, local_infile = self.local_infile)\n File “/home/testbox/frappe-bench/env/local/lib/python2.7/site-packages/pymysql/init.py”, line 90, in Connect\n return Connection(*args, **kwargs)\n File “/home/testbox/frappe-bench/env/local/lib/python2.7/site-packages/pymysql/connections.py”, line 699, in init\n self.connect()\n File “/home/testbox/frappe-bench/env/local/lib/python2.7/site-packages/pymysql/connections.py”, line 936, in connect\n self._request_authentication()\n File “/home/testbox/frappe-bench/env/local/lib/python2.7/site-packages/pymysql/connections.py”, line 1156, in _request_authentication\n auth_packet = self._read_packet()\n File “/home/testbox/frappe-bench/env/local/lib/python2.7/site-packages/pymysql/connections.py”, line 1018, in _read_packet\n packet.check_error()\n File “/home/testbox/frappe-bench/env/local/lib/python2.7/site-packages/pymysql/connections.py”, line 384, in check_error\n err.raise_mysql_exception(self._data)\n File “/home/testbox/frappe-bench/env/local/lib/python2.7/site-packages/pymysql/err.py”, line 107, in raise_mysql_exception\n raise errorclass(errno, errval)\npymysql.err.OperationalError: (1045, u"Access denied for user ‘1bd3e0294da19198’@‘localhost’ (using password: YES)")", “stderr_lines”: [“Traceback (most recent call last):”, " File “/usr/lib/python2.7/runpy.py”, line 174, in _run_module_as_main", " “main”, fname, loader, pkg_name)", " File “/usr/lib/python2.7/runpy.py”, line 72, in _run_code", " exec code in run_globals", " File “/home/testbox/frappe-bench/apps/frappe/frappe/utils/bench_helper.py”, line 94, in “, " main()”, " File “/home/testbox/frappe-bench/apps/frappe/frappe/utils/bench_helper.py”, line 18, in main", " click.Group(commands=commands)(prog_name=‘bench’)", " File “/home/testbox/frappe-bench/env/local/lib/python2.7/site-packages/click/core.py”, line 722, in call", " return self.main(*args, **kwargs)", " File “/home/testbox/frappe-bench/env/local/lib/python2.7/site-packages/click/core.py”, line 697, in main", " rv = self.invoke(ctx)", " File “/home/testbox/frappe-bench/env/local/lib/python2.7/site-packages/click/core.py”, line 1066, in invoke", " return _process_result(sub_ctx.command.invoke(sub_ctx))", " File “/home/testbox/frappe-bench/env/local/lib/python2.7/site-packages/click/core.py”, line 1066, in invoke", " return _process_result(sub_ctx.command.invoke(sub_ctx))", " File “/home/testbox/frappe-bench/env/local/lib/python2.7/site-packages/click/core.py”, line 895, in invoke", " return ctx.invoke(self.callback, **ctx.params)", " File “/home/testbox/frappe-bench/env/local/lib/python2.7/site-packages/click/core.py”, line 535, in invoke", " return callback(*args, **kwargs)", " File “/home/testbox/frappe-bench/env/local/lib/python2.7/site-packages/click/decorators.py”, line 17, in new_func", " return f(get_current_context(), *args, **kwargs)", " File “/home/testbox/frappe-bench/apps/frappe/frappe/commands/init.py”, line 24, in _func", " ret = f(frappe._dict(ctx.obj), *args, **kwargs)", " File “/home/testbox/frappe-bench/apps/frappe/frappe/commands/site.py”, line 165, in install_app", " _install_app(app, verbose=context.verbose)", " File “/home/testbox/frappe-bench/apps/frappe/frappe/installer.py”, line 109, in install_app", " frappe.clear_cache()", " File “/home/testbox/frappe-bench/apps/frappe/frappe/init.py”, line 516, in clear_cache", " for fn in get_hooks(“clear_cache”):", " File “/home/testbox/frappe-bench/apps/frappe/frappe/init.py”, line 832, in get_hooks", " hooks = _dict(cache().get_value(“app_hooks”, load_app_hooks))", " File “/home/testbox/frappe-bench/apps/frappe/frappe/utils/redis_wrapper.py”, line 73, in get_value", " val = generator()", " File “/home/testbox/frappe-bench/apps/frappe/frappe/init.py”, line 810, in load_app_hooks", " for app in [app_name] if app_name else get_installed_apps(sort=True):", " File “/home/testbox/frappe-bench/apps/frappe/frappe/init.py”, line 774, in get_installed_apps", " installed = json.loads(db.get_global(“installed_apps”) or “[]”)", " File “/home/testbox/frappe-bench/apps/frappe/frappe/database.py”, line 726, in get_global", " return self.get_default(key, user)", " File “/home/testbox/frappe-bench/apps/frappe/frappe/database.py”, line 738, in get_default", " d = self.get_defaults(key, parent)", " File “/home/testbox/frappe-bench/apps/frappe/frappe/database.py”, line 744, in get_defaults", " defaults = frappe.defaults.get_defaults(parent)", " File “/home/testbox/frappe-bench/apps/frappe/frappe/defaults.py”, line 57, in get_defaults", " globald = get_defaults_for()", " File “/home/testbox/frappe-bench/apps/frappe/frappe/defaults.py”, line 177, in get_defaults_for", " where parent = %s order by creation""", (parent,), as_dict=1)", " File “/home/testbox/frappe-bench/apps/frappe/frappe/database.py”, line 143, in sql", " self.connect()", " File “/home/testbox/frappe-bench/apps/frappe/frappe/database.py”, line 93, in connect", " charset=‘utf8mb4’, use_unicode = True, conv = conversions, local_infile = self.local_infile)", " File “/home/testbox/frappe-bench/env/local/lib/python2.7/site-packages/pymysql/init.py”, line 90, in Connect", " return Connection(*args, **kwargs)", " File “/home/testbox/frappe-bench/env/local/lib/python2.7/site-packages/pymysql/connections.py”, line 699, in init", " self.connect()", " File “/home/testbox/frappe-bench/env/local/lib/python2.7/site-packages/pymysql/connections.py”, line 936, in connect", " self._request_authentication()", " File “/home/testbox/frappe-bench/env/local/lib/python2.7/site-packages/pymysql/connections.py”, line 1156, in _request_authentication", " auth_packet = self._read_packet()", " File “/home/testbox/frappe-bench/env/local/lib/python2.7/site-packages/pymysql/connections.py”, line 1018, in _read_packet", " packet.check_error()", " File “/home/testbox/frappe-bench/env/local/lib/python2.7/site-packages/pymysql/connections.py”, line 384, in check_error", " err.raise_mysql_exception(self._data)", " File “/home/testbox/frappe-bench/env/local/lib/python2.7/site-packages/pymysql/err.py”, line 107, in raise_mysql_exception", " raise errorclass(errno, errval)", “pymysql.err.OperationalError: (1045, u"Access denied for user ‘1bd3e0294da19198’@‘localhost’ (using password: YES)”)"], “stdout”: “”, “stdout_lines”: []}
to retry, use: --limit @/tmp/.bench/playbooks/develop/install.retry
PLAY RECAP *************************************************************************************************************************************************************************************************
localhost : ok=45 changed=7 unreachable=0 failed=1
Traceback (most recent call last):
File “install.py”, line 386, in
install_bench(args)
File “install.py”, line 109, in install_bench
run_playbook(‘develop/install.yml’, sudo=True, extra_vars=extra_vars)
File “install.py”, line 324, in run_playbook
success = subprocess.check_call(args, cwd=os.path.join(cwd, ‘playbooks’))
File “/usr/lib/python2.7/subprocess.py”, line 541, in check_call
raise CalledProcessError(retcode, cmd)
subprocess.CalledProcessError: Command ‘[‘ansible-playbook’, ‘-c’, ‘local’, ‘develop/install.yml’, ‘-e’, ‘@/tmp/extra_vars.json’, ‘–become’, ‘–become-user=testbox’]’ returned non-zero exit status 2

^^^
OS is Ubuntu 16.04 LTS
Can’t seem to get past this local host error… any advice??

You may have to reset your DB password and try. Check your site_config file to see if your db password is correct.